{"text_format":"1","workbook":"xlsx","n_sheets":12,"sheets":["Welcome!","Reproduction(R)","R. Investment Costs","R. Operating Costs","R. Revenue","Growout (GO)","GO. Investment Costs","GO. Operating Costs","GO. Revenue","GO & R results","Currency data","Tables"],"not_rendered":{"charts":0,"images":6,"macros":1,"external_links":0,"defined_names":0,"comments":0,"pivot_tables":0},"unopened":[],"bounds":{"document_bytes":16777216,"sheet_cells":100000,"rows_first":2000,"rows_last":500,"rows_between":2000,"halvings":0,"cell_chars":16384,"cell_head_chars":4096},"cells_cut":0,"cells_raw":0,"read":"whole","date_system":"1900"}

{"sheet":"Welcome!","index":0,"n_rows":55,"n_cols":10,"rows_kept":55,"cut":false,"hidden":false,"merged":[[0,1,14,10],[26,2,26,9],[31,2,31,9],[15,2,15,9],[17,2,20,9],[24,4,24,9],[28,3,28,6],[30,2,30,9],[38,2,38,9],[49,2,49,9],[53,2,53,9],[54,2,55,9],[25,4,25,9],[33,7,33,9],[42,2,42,9],[51,2,51,9],[44,2,45,9]]}
[]
[]
[]
[]
[]
[]
[]
[]
[]
[]
[]
[]
[]
[]
[]
[null,null,"SIMplified Black soldier fly Approach - COST MODEL"]
[]
[null,null,"This cost model is based on: The SIMBA Grow-Out Guide¹ and The SIMBA Reproduction Guide². Accordingly, this cost model is divided into two parts: Grow-Out Unit and Reproduction Unit, estimating cost and revenue based on one year of operation.  \nDisclaimer: Eawag and the authors assume no responsibility for errors or omissions in this document or for any actions taken based on the information provided. Eawag and the authors are not liable for any damages arising from the use of this document.                   "]
[]
[]
{"$rows_left_out":36}
{"sheet":"Reproduction(R)","index":1,"n_rows":65,"n_cols":6,"rows_kept":65,"cut":false,"hidden":false,"merged":[[13,2,13,5],[20,2,20,5],[64,2,65,5],[15,2,18,5],[61,2,62,5]]}
[]
[]
[]
[]
[]
[]
[]
[]
[]
[]
[]
[]
[]
[null,null,"Reproduction Unit "]
[]
[null,null,"This page provides an overview of your investment, operational expenses and revenues related to the reproduction unit. Default values are based on the SIMBA Reproduction Guide², which aims to treat 250 kg of waste per week. To increase accuracy, please ensure that the performance indicators and default values below are aligned with values from your facility and your treatment capacity."]
[]
[]
[]
[]
{"$rows_left_out":46}
{"sheet":"R. Investment Costs","index":2,"n_rows":75,"n_cols":10,"rows_kept":75,"cut":false,"hidden":false,"merged":[[30,2,30,7],[5,2,6,7],[8,2,8,7],[3,2,3,3],[69,2,69,7]]}
[]
[]
[]
[null,null,"Investment Costs",null,null,"Total:",{"$f":"H65","v":1740.27},{"$f":"'Welcome!'!I29","v":"EUR"}]
[]
[null,null,"Investment costs refer to the initial one-time expenditure needed to set up the facility. All yellow cells show a default value. These default values are based on the values from the SIMBA Reproduction Guide².  "]
[]
[]
[null,null,"If you have more accurate data, change the default values in the yellow cells to represent your facility."]
[]
[]
[null,null,"A","Building and Civil Works","Amount*",{"$f":"'Welcome!'!I29&\" / unit*\"","v":"EUR / unit*"}," Total*"," Total","Lifetime(years)","Dep. per year"]
[null,null,"1","Material",null,null,{"$f":"SUM(G14:G24)","v":814.26},{"$f":"IF('Reproduction(R)'!F23=250,G13,0)","v":814.26},30,{"$f":"H13/I13","v":27.141999999999999}]
[null,null,"1.1","Cement",23,{"$f":"8.85*'Welcome!'!I30","v":8.85},{"$f":"E14*F14","v":203.54999999999998}]
[null,null,"1.2","Bricks",6500,{"$f":"0.01*'Welcome!'!I30","v":0.01},{"$f":"E15*F15","v":65}]
[null,null,"1.3","River sand (ton)",6,{"$f":"3.69*'Welcome!'!I30","v":3.69},{"$f":"E16*F16","v":22.14}]
[null,null,"1.4","Iron sheets ",26,{"$f":"10*'Welcome!'!I30","v":10},{"$f":"E17*F17","v":260}]
[null,null,"1.5","Roofing nails (kgs)",5,{"$f":"1.87*'Welcome!'!I30","v":1.87},9.3500000000000014]
[null,null,"1.6","Wire nails (kgs)",14,{"$f":"1.8*'Welcome!'!I30","v":1.8},25.2]
[null,null,"1.7","Timber Guard (liter)",2,{"$f":"1.35*'Welcome!'!I30","v":1.35},2.7]
{"$rows_left_out":56}
{"sheet":"R. Operating Costs","index":3,"n_rows":42,"n_cols":7,"rows_kept":42,"cut":false,"hidden":false,"merged":[[4,2,6,6],[8,2,8,6],[29,2,29,6],[20,2,20,6]]}
[]
[]
[null,null,"Operating cost ",null,"Total:",{"$f":"G42","v":17.402699999999999},{"$f":"'Welcome!'!I29&\"/ year\"","v":"EUR/ year"}]
[]
[null,null,"Operating costs are all your weekly expenses required to operate a Reproduction Unit. All yellow cells show a default value. These default values are calculated based on the values from the SIMBA Reproduction Guide².  You can change the default values to represent your facility more accurately."]
[]
[]
[]
[null,null,"If you have more accurate data, change the default values in the yellow cells to represent your facility."]
[]
[null,null,"E","Feed Cost ",null,"Weekly","Yearly"]
[null,null,1,"Feed in kg","Weekly (default value)"]
[null,null,1.1000000000000001,"Feed 0-7-DOL (e.g., chicken feed)",{"$f":"6/1000*'Reproduction(R)'!F23","v":1.5},{"$f":"E13","v":1.5},{"$f":"F13*52","v":78}]
[null,null,1.2,"Waste substrate 7-DOL-Prepupae (e.g. foodwaste)",{"$f":"'Reproduction(R)'!F32/'Reproduction(R)'!F49","v":50},{"$f":"E14","v":50},{"$f":"F14*52","v":2600}]
[null,null,1.3,"Additives (e.g. saw dust or rice husk)",0,0,0]
[null,null,2,{"$f":"IF(G20=0,\"Feed cost *\",\"Feed Cost\")","v":"Feed cost *"},{"$f":"'Welcome!'!I29&\" / kg\"","v":"EUR / kg"}]
[null,null,2.1,"Feed 0-7-DOL",0,{"$f":"E13*E17","v":0},{"$f":"G13*E17","v":0}]
[null,null,2.2000000000000002,"Waste substrate 7-DOL-Prepupae (e.g. foodwaste)",0,{"$f":"E14*E18","v":0},{"$f":"G14*E18","v":0}]
[null,null,2.2999999999999998,"Additives (e.g. saw dust or rice husk)",0,{"$f":"E19*E15","v":0},{"$f":"E19*G15","v":0}]
[null,null,"E","Total feed cost",null,{"$f":"F17+F18","v":0},{"$f":"G17+G18","v":0}]
{"$rows_left_out":23}
{"sheet":"R. Revenue","index":4,"n_rows":32,"n_cols":7,"rows_kept":32,"cut":false,"hidden":false,"merged":[[4,2,5,6],[7,2,7,6],[25,2,25,6],[16,2,16,6],[31,2,31,6]]}
[]
[]
[null,null,"Sale revenue",null,"Total:",{"$f":"G28","v":795.05454545454552},{"$f":"'Welcome!'!I29&\"/ year\"","v":"EUR/ year"}]
[]
[null,null,{"$f":"\"Sales revenue shows the income you will generate from your reproduction unit; selling fresh 7-dol  and/or remaining frass. Adjust the sales prices (\"&'Welcome!'!J30&\" /kg) in the yellow cells to make the calculation more accurate for your case.\"","v":"Sales revenue shows the income you will generate from your reproduction unit; selling fresh 7-dol  and/or remaining frass. Adjust the sales prices (EUR /kg) in the yellow cells to make the calculation more accurate for your case."}]
[]
[]
[null,null,"If you have more accurate data, change the default values in the yellow cells to represent your facility."]
[]
[null,null,"H","7-DOL*",null,"Weekly","Yearly"]
[null,null,1,"7-DOL in gram"]
[null,null,1.1000000000000001,"gram 7-DOL harvested ",null,{"$f":"'Reproduction(R)'!F47/'Reproduction(R)'!F30","v":1048.951048951049},{"$f":"F12*52","v":54545.454545454544}]
[null,null,1.2,"7-DOL sold ",null,{"$f":"F12","v":1048.951048951049},{"$f":"F13*52","v":54545.454545454544}]
[null,null,2,"Sale price 7-DOL"]
[null,null,2.1,{"$f":"'Welcome!'!I29&\" / gram 7-DOL\"","v":"EUR / gram 7-DOL"},{"$f":"0.01*'Welcome!'!I30","v":0.01}]
[null,null,"H","Total Revenue: 7-DOL",null,{"$f":"E15*F13","v":10.48951048951049},{"$f":"E15*G13","v":545.4545454545455}]
[null,null,"*If you use the 7-DOL in your own reproduction unit; set sale price to 0."]
[]
[null,null,"I","Frass from 7-dol",null,"Weekly","Yearly"]
[null,null,1,"Frass in kg"]
{"$rows_left_out":13}
{"sheet":"Growout (GO)","index":5,"n_rows":83,"n_cols":7,"rows_kept":83,"cut":false,"hidden":false,"merged":[[94,3,94,4],[78,2,78,5],[58,3,58,4],[18,2,18,4],[27,2,28,3],[79,2,79,5],[46,2,46,5],[55,2,55,5],[56,2,56,5],[25,4,25,5],[21,2,23,3],[11,2,11,5],[16,2,16,3],[16,4,16,5],[82,2,82,5],[13,2,14,5]]}
[]
[]
[]
[]
[]
[]
[]
[]
[]
[]
[" "]
[null,null,"Growout Unit "]
[]
[null,null,"This model is based on the Growout SIMBA Guide¹, which aims to treat 50 kg of waste per week. Select options in all the empty orange cells to get an overview of the profit for your Growout Unit. "]
[]
[]
[null,null,"Default value - Optional to change ",null,"Select option"]
[]
[null,null,"1. How many kg waste (substrate) will you treat per week?",null,null,50]
[]
{"$rows_left_out":64}
{"sheet":"GO. Investment Costs","index":6,"n_rows":50,"n_cols":11,"rows_kept":50,"cut":false,"hidden":false,"merged":[[4,2,5,8],[43,2,44,8],[13,2,14,8],[6,2,6,4],[6,5,6,8]]}
[]
[]
[null,null,"Investment Costs",null,null,null,"Total:",{"$f":"I40","v":238.70000000000002},{"$f":"H9","v":"EUR"}]
[]
[null,null,"Investment costs refer to the initial one-time expenditure needed to set up the facility. All yellow cells show a default value. These default values are based on the values from the SIMBA Growout Guide¹.  If you have data you can change the default values that more accurately represent your facility."]
[]
[null,null,"Default value - Optional to change ",null,null,"Select option"]
[]
[null,null,"A","Building and Civil Works*",null,"Amount ",null,{"$f":"'Welcome!'!I29","v":"EUR"},"Total","Lifetime (years)",{"$f":"'Welcome!'!I29&\" / year\"","v":"EUR / year"}]
[null,null,1,"Building construction and materials",null,1,null,0,{"$f":"F10*H10","v":0},30,{"$f":"IFERROR(I10/J10,0)","v":0}]
[null,null,2,"Labor Cost",null,1,null,0,{"$f":"F11*H11","v":0},"-",{"$f":"IFERROR(I11/J11,0)","v":0}]
[null,null,3,"Other",null,1,null,0,{"$f":"F12*H12","v":0},30,0]
[null,null,"A","Total building and Civil Workers ",null,null,null,null,{"$f":"SUM(I10:I12)","v":0},null,{"$f":"SUM(K10:K12)","v":0}]
[null,null,{"$f":"\"*For treating \"&'Growout (GO)'!F19&\" kg waste, the SIMBA guide estimate that you need a \"&(150/250*'Growout (GO)'!F19)&\" m² roofed space. If you don' t have this space avaliable please estimate the costs.\"","v":"*For treating 50 kg waste, the SIMBA guide estimate that you need a 30 m² roofed space. If you don' t have this space avaliable please estimate the costs."}]
[]
[]
[null,null,"B","Equipment","Your dimensions","Amount","Your amount",{"$f":"'Welcome!'!I29&\" / unit\"","v":"EUR / unit"},"Total","Lifetime (years)",{"$f":"'Welcome!'!I29&\" / year\"","v":"EUR / year"}]
[null,null,1,"Pre-treatment"]
[null,null,"1.1","Bulk scale","-",{"$f":"ROUNDUP('Growout (GO)'!E63/10000000*1,0)","v":1},{"$f":"F19","v":1},{"$f":"74.5*'Welcome!'!I30","v":74.5},{"$f":"G19*H19","v":74.5},7,{"$f":"IFERROR(I19/J19,0)","v":10.642857142857142}]
[null,null,"1.2","Shovel/rake ","-",{"$f":"ROUNDUP('Growout (GO)'!E62/10000000*1,0)","v":1},{"$f":"F20","v":1},{"$f":"40*'Welcome!'!I30","v":40},{"$f":"G20*H20","v":40},5,{"$f":"IFERROR(I20/J20,0)","v":8}]
{"$rows_left_out":31}
{"sheet":"GO. Operating Costs","index":7,"n_rows":52,"n_cols":7,"rows_kept":52,"cut":false,"hidden":false,"merged":[[39,2,39,6],[5,2,6,6],[8,2,8,6],[29,2,30,6],[14,2,14,6]]}
[]
[]
[]
[null,null,"Operating Cost ",null,"Total:",{"$f":"G52","v":111.47790909090911},{"$f":"'Welcome!'!I29&\" /year\"","v":"EUR /year"}]
[]
[null,null,"Operating costs are all your weekly expenses required to operate a Grow-Out Unit. All yellow cells show a default value. These default values are calculated based on the values from the SIMBA Grow-Out Guide².  You can change the default values to represent your facility more accurately."]
[]
[]
[null,null,"If you have more accurate data, change the default values in the yellow cells to represent your facility."]
[" "]
[" ",null,"D","7-DOL Cost*",null,"Weekly","Yearly"]
[null,null,1,"gram 7-DOL ",null,{"$f":"'Growout (GO)'!E65*F18","v":209.79020979020979},{"$f":"'Growout (GO)'!E65*G18","v":10909.09090909091}]
[null,null,2,{"$f":"'Welcome!'!I29&\" / gram 7-DOL \"","v":"EUR / gram 7-DOL "},{"$f":"0.01*'Welcome!'!I30","v":0.01}]
[null,null,"D","Total cost 7-DOL",null,{"$f":"E13*F12","v":2.0979020979020979},{"$f":"E13*G12","v":109.09090909090911}]
[null,null,"* If you dont buy 7-DOL / have your own reproduction unit.: set the price to 0."]
[]
[null,null,"E",{"$f":"IF(G29=0,\"Waste Substrate Cost*\",\"Waste Substrate Cost\")","v":"Waste Substrate Cost*"},null,"Weekly","Yearly"]
[null,null,null,"Kg Waste Substrate treated",null,{"$f":"'Growout (GO)'!F19","v":50},{"$f":"F18*52","v":2600}]
[null,null,1,"Waste substrate in kg"]
[null,null,1.1000000000000001,{"$f":"'Growout (GO)'!E22","v":"Food waste"},{"$f":"'Growout (GO)'!F22","v":1},{"$f":"E20*F18","v":50},{"$f":"E20*G18","v":2600}]
{"$rows_left_out":33}
{"sheet":"GO. Revenue","index":8,"n_rows":59,"n_cols":7,"rows_kept":59,"cut":false,"hidden":false,"merged":[[59,2,59,3],[58,2,58,6],[4,2,5,6],[7,2,7,6],[35,2,35,6],[31,2,33,6]]}
[]
[]
[null,null,"Sale Revenue",null,"Total:",{"$f":"G27","v":0},{"$f":"'Welcome!'!I29&\"/ year\"","v":"EUR/ year"}]
[]
[null,null,{"$f":"\"Sales revenue shows the income you will generate from the grow-out unit selling fresh BSF larvae and/or frass.\nAdjust the sales prices (\"&'Welcome!'!J30&\" /kg) in the yellow cells to make the calculation more accurate for your case.\"","v":"Sales revenue shows the income you will generate from the grow-out unit selling fresh BSF larvae and/or frass.\nAdjust the sales prices (EUR /kg) in the yellow cells to make the calculation more accurate for your case."}]
[]
[]
[null,null,"If you have more accurate data, change the default values in the yellow cells to represent your facility."]
[]
[null,null,"H","Fresh BSF Larvae",null,"Weekly","Yearly"]
[null,null,1,"Larvae in kg","Weekly (default value)"]
[null,null,1.1000000000000001,"Fresh larvae sold",{"$f":"IF('Growout (GO)'!E31=\"Yes\",'Growout (GO)'!E35,0)","v":0},{"$f":"E12","v":0},{"$f":"F12*52","v":0}]
[null,null,1.2,"Dried larvae sold",0,0,{"$f":"F13*52","v":0}]
[null,null,2,"Revenue larvae",{"$f":"'Welcome!'!I29&\" / kg \"","v":"EUR / kg "}]
[null,null,2.1,"Fresh larvae",{"$f":"1.5*'Welcome!'!I30","v":1.5},{"$f":"E15*F12","v":0},{"$f":"E15*G12","v":0}]
[null,null,2.2000000000000002,"Dried larvae",{"$f":"1.02*'Welcome!'!I30","v":1.02},{"$f":"E16*F13","v":0},{"$f":"E16*G13","v":0}]
[null,null,"H","Total Revenue: BSF Larvae",null,{"$f":"SUM(F15:F16)","v":0},{"$f":"SUM(G15:G16)","v":0}]
[]
[null,null,"I","Frass / Organic Fertilizer",null,"Weekly","Yearly"]
[null,null,1,"Frass in kg","Weekly (default value)"]
{"$rows_left_out":40}
{"sheet":"GO & R results","index":9,"n_rows":43,"n_cols":5,"rows_kept":43,"cut":false,"hidden":false,"merged":[[7,2,7,4],[3,2,3,4],[5,2,5,3],[6,2,6,3]]}
[]
[]
[null,null,"Overview of Combined Unit"]
[null,null,"This page presents the overall costs amd revenues and the resulting profit from your Reproduction and Growout unit. "]
[null,null,null,null,{"$f":"'Welcome!'!J30","v":"EUR"}]
[null,null,"First year profit when including first year investment costs",null,{"$f":"E42","v":-786.99404277922122}]
[null,null,"Profit first year (excluding investment *)",null,{"$f":"E43","v":1191.975957220779}]
[null,null,"*Annual depreciation on investments included."]
[]
[null,null,"Cost and Revenue ; Reproduction Unit",null,{"$f":"'Welcome!'!J30 &\" after one year\"","v":"EUR after one year"}]
[null,null,null,"Investment Costs ",{"$f":"'Reproduction(R)'!E56","v":-1740.27}]
[null,null,null,"Wear and Tear Cost ",{"$f":"'Reproduction(R)'!E57","v":-149.40400000000002}]
[null,null,null,"Operating Costs ",{"$f":"'Reproduction(R)'!E58","v":-17.402699999999999}]
[null,null,null,"Sale Revenue ",{"$f":"'Reproduction(R)'!E59","v":795.05454545454552}]
[]
[]
[null,null,"Cost and Revenue ; Growout Unit",null,{"$f":"'Welcome!'!J30 &\" after one year\"","v":"EUR after one year"}]
[null,null,null,"Investment Costs ",{"$f":"'Growout (GO)'!E40","v":-238.70000000000002}]
[null,null,null,"Wear and Tear Cost ",{"$f":"'Growout (GO)'!E41","v":-60.042857142857137}]
[null,null,null,"Operating Costs ",{"$f":"'Growout (GO)'!E42","v":-111.47790909090911}]
{"$rows_left_out":24}
{"sheet":"Currency data","index":10,"n_rows":188,"n_cols":3,"rows_kept":188,"cut":false,"hidden":true,"merged":[]}
["Country","Currency Code","Currency Name"]
["Algeria","DZD","Algerian Dinar"]
["Angola","AOA","Angolan Kwanza"]
["Benin","XOF","West African CFA Franc"]
["Botswana","BWP","Botswana Pula"]
["Burkina Faso","XOF","West African CFA Franc"]
["Burundi","BIF","Burundian Franc"]
["Cameroon","XAF","Central African CFA Franc"]
["Cape Verde","CVE","Cape Verdean Escudo"]
["Central African Republic","XAF","Central African CFA Franc"]
["Chad","XAF","Central African CFA Franc"]
["Comoros","KMF","Comorian Franc"]
["Côte d'Ivoire","XOF","West African CFA Franc"]
["Democratic Republic of the Congo","CDF","Congolese Franc"]
["Djibouti","DJF","Djiboutian Franc"]
["Egypt","EGP","Egyptian Pound"]
["Equatorial Guinea","XAF","Central African CFA Franc"]
["Eritrea","ERN","Eritrean Nakfa"]
["Eswatini","SZL","Swazi Lilangeni"]
["Ethiopia","ETB","Ethiopian Birr"]
{"$rows_left_out":169}
{"sheet":"Tables","index":11,"n_rows":13,"n_cols":13,"rows_kept":13,"cut":false,"hidden":true,"merged":[]}
["Substrate data  and tables"]
["Substrate","Bioconvertion rate to larvae","Bioconvention rate to frass","Waste reduction","Price",null,"Prosentage option",null,"Yes/no option",null,"Post prosessing",null,"Units"]
["Chicken feed",0.190266666666667,{"$f":"1-Substrate[[#This Row],[Waste reduction]]","v":0.26706666666666701},0.73293333333333299,null,null,0,null,"Yes",null,"Microwave",null,"Reproduction Unit"]
["Chicken manure",7.5266666666666704E-2,{"$f":"1-Substrate[[#This Row],[Waste reduction]]","v":0.49480000000000002},0.50519999999999998,null,null,0.1,null,"No",null,"Solar oven",null,"Grow-out Unit"]
["Cow manure",5.5649999999999998E-2,{"$f":"1-Substrate[[#This Row],[Waste reduction]]","v":0.62070000000000003},0.37930000000000003,null,null,0.2,null,null,null,"Hot-air oven",null,"Both Reproduction and Grow-out Unit"]
["Faecal sludge",4.9000000000000002E-2,{"$f":"1-Substrate[[#This Row],[Waste reduction]]","v":0.49319999999999997},0.50680000000000003,null,null,0.3,null,null,null,"Other"]
["Food waste",0.18886,{"$f":"1-Substrate[[#This Row],[Waste reduction]]","v":0.42244999999999999},0.57755000000000001,null,null,0.4]
["Fruits  ",0.18099999999999999,{"$f":"1-Substrate[[#This Row],[Waste reduction]]","v":0.33035000000000003},0.66964999999999997,null,null,0.5]
["Pig manure",9.4333333333333297E-2,{"$f":"1-Substrate[[#This Row],[Waste reduction]]","v":0.62580000000000002},0.37419999999999998,null,null,0.6]
["Vegetable waste",0.21213333333333301,{"$f":"1-Substrate[[#This Row],[Waste reduction]]","v":0.49913333333333298},0.50086666666666702,null,null,0.7]
["Other",0.1,0.3,null,null,null,0.8]
[null,null,null,null,null,null,0.9]
[null,null,null,null,null,null,1]